Remove autotools.

2 jobs for master in 12 minutes and 25 seconds (queued for 11 seconds)
Status Job ID Name Coverage
  Test
failed #2013
dune:git--clang

00:12:25

failed #2014
dune:git--gcc

00:12:11

 
Name Stage Failure
failed
dune:git--gcc Test There is an unknown failure, please try again
CMakeFiles/Makefile2:2541: recipe for target 'dune/fufem/test/CMakeFiles/h1functionalassemblertest.dir/all' failed
make[2]: *** [dune/fufem/test/CMakeFiles/h1functionalassemblertest.dir/all] Error 2
CMakeFiles/Makefile2:168: recipe for target 'CMakeFiles/build_tests.dir/rule' failed
make[1]: *** [CMakeFiles/build_tests.dir/rule] Error 2
make: *** [build_tests] Error 2
Makefile:221: recipe for target 'build_tests' failed
--- Failed to build dune-fufem ---
Terminating dunecontrol due to previous errors!
ERROR: Build failed: exit code 1
failed
dune:git--clang Test There is an unknown failure, please try again
make[2]: *** [dune/fufem/test/CMakeFiles/h1functionalassemblertest.dir/all] Error 2
CMakeFiles/Makefile2:2541: recipe for target 'dune/fufem/test/CMakeFiles/h1functionalassemblertest.dir/all' failed
make[1]: *** [CMakeFiles/build_tests.dir/rule] Error 2
CMakeFiles/Makefile2:168: recipe for target 'CMakeFiles/build_tests.dir/rule' failed
Makefile:221: recipe for target 'build_tests' failed
make: *** [build_tests] Error 2
--- Failed to build dune-fufem ---
Terminating dunecontrol due to previous errors!
ERROR: Build failed: exit code 1