Remove ConstantFunction implementation it's in dune/solvers/tests/common.hh

2 jobs for new_interface
latest
Status Name Job ID Coverage
  Test
failed dune:git--clang #658

00:00:24

failed dune:git--gcc #659

00:00:23

 
Name Stage Failure
failed
dune:git--gcc Test There is an unknown failure, please try again
CMakeFiles/Makefile2:1454: recipe for target 'dune/tnnmg/test/CMakeFiles/gradientmethodtest.dir/all' failed
make[1]: *** [CMakeFiles/build_tests.dir/rule] Error 2
make: *** [build_tests] Error 2
CMakeFiles/Makefile2:1005: recipe for target 'CMakeFiles/build_tests.dir/rule' failed
Makefile:572: recipe for target 'build_tests' failed
--- Failed to build dune-tnnmg ---
Terminating dunecontrol due to previous errors!

ERROR: Build failed with: exit code 1
failed
dune:git--clang Test There is an unknown failure, please try again
make[2]: *** [dune/tnnmg/test/CMakeFiles/gradientmethodtest.dir/all] Error 2
CMakeFiles/Makefile2:1005: recipe for target 'CMakeFiles/build_tests.dir/rule' failed
make[1]: *** [CMakeFiles/build_tests.dir/rule] Error 2
Makefile:572: recipe for target 'build_tests' failed
make: *** [build_tests] Error 2
--- Failed to build dune-tnnmg ---
Terminating dunecontrol due to previous errors!

ERROR: Build failed with: exit code 1