Use RobustComparabilityCheck

2 jobs for feature/guarded-concept-check in 2 minutes and 24 seconds (queued for 3 seconds)
Status Name Job ID Coverage
  Test
failed dune:git--clang #1372

00:00:31

passed dune:git--gcc #1373

00:01:52

 
Name Stage Failure
failed
dune:git--clang Test There is an unknown failure, please try again
make[2]: *** [dune/tnnmg/test/CMakeFiles/multitypegstest.dir/all] Error 2
CMakeFiles/Makefile2:145: recipe for target 'CMakeFiles/build_tests.dir/rule' failed
make[1]: *** [CMakeFiles/build_tests.dir/rule] Error 2
Makefile:221: recipe for target 'build_tests' failed
make: *** [build_tests] Error 2
--- Failed to build dune-tnnmg ---
Terminating dunecontrol due to previous errors!

ERROR: Build failed: exit code 1