<?xml version="1.0" encoding="UTF-8" standalone="no"?>
<svg
   xmlns:dc="http://purl.org/dc/elements/1.1/"
   xmlns:cc="http://creativecommons.org/ns#"
   xmlns:rdf="http://www.w3.org/1999/02/22-rdf-syntax-ns#"
   xmlns:svg="http://www.w3.org/2000/svg"
   xmlns="http://www.w3.org/2000/svg"
   xmlns:sodipodi="http://sodipodi.sourceforge.net/DTD/sodipodi-0.dtd"
   xmlns:inkscape="http://www.inkscape.org/namespaces/inkscape"
   width="200"
   height="200"
   viewBox="0 0 58.622293 52.916665"
   version="1.1"
   id="svg8"
   inkscape:version="1.0.1 (1.0.1+r74)"
   sodipodi:docname="logo.svg">
  <defs
     id="defs2" />
  <sodipodi:namedview
     id="base"
     pagecolor="#ffffff"
     bordercolor="#666666"
     borderopacity="1.0"
     inkscape:pageopacity="0.0"
     inkscape:pageshadow="2"
     inkscape:zoom="2.8284272"
     inkscape:cx="128.57888"
     inkscape:cy="128.34311"
     inkscape:document-units="mm"
     inkscape:current-layer="layer1"
     showgrid="false"
     showguides="true"
     inkscape:guide-bbox="true"
     inkscape:window-width="1848"
     inkscape:window-height="1043"
     inkscape:window-x="72"
     inkscape:window-y="0"
     inkscape:window-maximized="1"
     fit-margin-top="2"
     fit-margin-left="2"
     fit-margin-right="2"
     fit-margin-bottom="2"
     inkscape:document-rotation="0"
     units="px"
     viewbox-width="14.38421">
    <sodipodi:guide
       position="6.9419081,49.447204"
       orientation="0,1"
       id="guide4551"
       inkscape:locked="false" />
    <sodipodi:guide
       position="12.255697,49.652884"
       orientation="1,0"
       id="guide4553"
       inkscape:locked="false" />
    <sodipodi:guide
       position="12.255696,48.644374"
       orientation="0,1"
       id="guide4555"
       inkscape:locked="false" />
    <sodipodi:guide
       position="12.255696,50.281274"
       orientation="0,1"
       id="guide4557"
       inkscape:locked="false" />
  </sodipodi:namedview>
  <metadata
     id="metadata5">
    <rdf:RDF>
      <cc:Work
         rdf:about="">
        <dc:format>image/svg+xml</dc:format>
        <dc:type
           rdf:resource="http://purl.org/dc/dcmitype/StillImage" />
        <dc:title></dc:title>
      </cc:Work>
    </rdf:RDF>
  </metadata>
  <g
     inkscape:label="Layer 1"
     inkscape:groupmode="layer"
     id="layer1"
     transform="translate(-31.029269,-81.833148)">
    <g
       id="g90"
       transform="matrix(4.8172413,0,0,4.8172413,-120.68396,-303.73155)">
      <g
         aria-label="I"
         transform="rotate(45)"
         id="text4549"
         style="font-style:normal;font-variant:normal;font-weight:normal;font-stretch:normal;font-size:10.5833px;line-height:125%;font-family:'Open Sans';-inkscape-font-specification:'Open Sans';letter-spacing:0px;word-spacing:0px;fill:#00b2ee;fill-opacity:1;stroke:none;stroke-width:0.264583px;stroke-linecap:butt;stroke-linejoin:miter;stroke-opacity:1">
        <path
           d="m 79.05809,33.468537 h 7.555071 l -1e-6,0.878497 -7.55507,-10e-7 z"
           style="fill:#00b2ee;fill-opacity:1;stroke-width:0.264583px"
           id="path78" />
      </g>
      <g
         aria-label="O"
         transform="rotate(45)"
         id="text4522"
         style="font-style:normal;font-variant:normal;font-weight:normal;font-stretch:normal;font-size:10.5833px;line-height:125%;font-family:'Open Sans';-inkscape-font-specification:'Open Sans';letter-spacing:0px;word-spacing:0px;fill:#00b2ee;fill-opacity:1;stroke:none;stroke-width:0.264583px;stroke-linecap:butt;stroke-linejoin:miter;stroke-opacity:1">
        <path
           d="m 93.535483,33.904631 q 0,1.813837 -0.919838,2.85253 -0.914669,1.038693 -2.54764,1.038693 -1.669143,0 -2.578645,-1.018023 -0.904335,-1.02319 -0.904335,-2.883536 0,-1.844842 0.909502,-2.857697 0.909503,-1.018023 2.583814,-1.018023 1.627802,0 2.542472,1.033526 0.91467,1.033525 0.91467,2.85253 z m -6.020285,0 q 0,1.534785 0.651121,2.330599 0.656288,0.790647 1.901686,0.790647 1.255734,0 1.896519,-0.790647 0.640786,-0.790647 0.640786,-2.330599 0,-1.52445 -0.640786,-2.30993 -0.635618,-0.790646 -1.886183,-0.790646 -1.255734,0 -1.912022,0.795814 -0.651121,0.790647 -0.651121,2.304762 z"
           style="fill:#114b5f;fill-opacity:1"
           id="path81" />
      </g>
      <circle
         style="fill:#72d8e8;fill-opacity:1;stroke:none;stroke-width:0.1;stroke-linecap:butt;stroke-linejoin:round;stroke-miterlimit:4.2;stroke-dasharray:none;stroke-opacity:1"
         id="path4528"
         cx="91.348862"
         cy="33.085918"
         r="0.4252232"
         transform="rotate(45)" />
      <circle
         style="fill:#72d8e8;fill-opacity:1;stroke:none;stroke-width:0.1;stroke-linecap:butt;stroke-linejoin:round;stroke-miterlimit:4.2;stroke-dasharray:none;stroke-opacity:1"
         id="path4528-3"
         cx="91.350044"
         cy="34.700588"
         r="0.4252232"
         transform="rotate(45)" />
    </g>
  </g>
</svg>
