[
    {
        "model": "quiz.sport",    
        "pk": 1,
        "fields": {
            "name" : "After Work Fitness",
            "url": "https://www.buchsys.de/fu-berlin/angebote/aktueller_zeitraum/_Tischtennis.html"
        }
    },
    
    {
        "model": "quiz.sport", 
        "pk": 2,
        "fields": {
            "name": "Ballett",
            "url":"https://www.buchsys.de/fu-berlin/angebote/aktueller_zeitraum/_Ballett.html"
      }
    },
    {
        "model": "quiz.sport", 
        "pk":3,
        "fields": {
            "name":"Basketball",
            "url":"https://www.buchsys.de/fu-berlin/angebote/aktueller_zeitraum/_Basketball.html"
        }
    },  
    {
        "model": "quiz.sport", 
        "pk":4,
        "fields": {
            "name":"Beachvolleyball",
            "url":"https://www.buchsys.de/fu-berlin/angebote/aktueller_zeitraum/_Beachvolleyball.html"
        }
    },  
    {
        "model": "quiz.sport", 
        "pk":5,
        "fields": {
            "name":"Bouldern",
            "url":"https://www.buchsys.de/fu-berlin/angebote/aktueller_zeitraum/_Bouldern.html"
        }
    },   
    {
        "model": "quiz.sport", 
        "pk":6,
        "fields": {
            "name":"Gerätturnen",
            "url":"https://www.buchsys.de/fu-berlin/angebote/aktueller_zeitraum/_Geraetturnen.html"
        }
    },  
    {
        "model": "quiz.sport", 
        "pk":7,
        "fields": {
            "name": "HIIT",
            "url": "https://www.buchsys.de/fu-berlin/angebote/aktueller_zeitraum/_HIIT_-_High_Intensity_Interval_Training.html"
        }
    },  
    {
        "model": "quiz.sport", 
        "pk":8,
        "fields": {
        "name":"Karate",
        "url":"https://www.buchsys.de/fu-berlin/angebote/aktueller_zeitraum/_Karate_-_Modernes_Sportkarate.html"
        }
    },  
    {
        "model": "quiz.sport", 
        "pk":9,
        "fields": {
            "name":"Kickboxen",
            "url":"https://www.buchsys.de/fu-berlin/angebote/aktueller_zeitraum/_Kick-Boxen.html"
        }
    } , 
    {
        "model": "quiz.sport", 
        "pk":10,
        "fields": {
            "name":"Laufen",
            "url":"https://www.buchsys.de/fu-berlin/angebote/aktueller_zeitraum/_Basketball.html"
        }
    }
  ]    
  
  
  
  


